{"text_format":"1","workbook":"xlsx","n_sheets":6,"sheets":["Hoja1","Hoja2","Hoja3","Hoja4","Datos","PreEmpleo"],"not_rendered":{"charts":0,"images":1,"macros":1,"external_links":0,"defined_names":4,"comments":0,"pivot_tables":0},"unopened":[],"bounds":{"document_bytes":16777216,"sheet_cells":100000,"rows_first":2000,"rows_last":500,"rows_between":2000,"halvings":0,"cell_chars":16384,"cell_head_chars":4096},"cells_cut":0,"cells_raw":0,"read":"whole","date_system":"1900"}

{"sheet":"Hoja1","index":0,"n_rows":45,"n_cols":10,"rows_kept":45,"cut":false,"hidden":false,"merged":[[0,0,2,1],[0,2,0,7],[1,2,1,7],[2,2,2,7],[3,0,3,1],[3,2,3,4],[3,5,3,7],[4,4,5,4],[4,5,5,5],[4,6,5,6],[4,7,5,7],[4,1,5,1],[4,2,5,2],[4,3,5,3]]}
[null,null,"DIRECCIÓN DE DESARROLLO HUMANO"]
[null,null,"GESTIONAR LOS SERVICIOS PARA LA SALUD DE LA COMUNIDAD UNIVERSITARIA"]
[null,null,"BU-FORMATO CONTROL DE CIRCULACIÓN Y ARCHIVO DE LAS HISTORIAS CLÍNICAS"]
["Versión: 6",null,"FECHA DE ACTUALIZACION: Noviembre 21 de 2012",null,null,"FR-BU-GSSCU-04-01"]
["TIPO DE USUARIO","HISTORIA CLINICA NÚMERO","FECHA DE EGRESO\nARCHIVO CLÍNICO","RESPONSABLE","ENTREGADA A","\nDESTINO OFICINA No \n\n  ","FECHA DE INGRESO\nARCHIVO CLÍNICO","RESPONSABLE"]
["ESTUDIANTE\nEMPLEADO  "]
[null,null,null,null,null,null,null,null,null,{"$f":"NOT(ISERROR(MATCH(B7,Hoja4!A:A,0)))","v":false}]
[null,null,null,null,null,null,null,null,null,{"$f":"NOT(ISERROR(MATCH(B8,Hoja4!A:A,0)))","v":false}]
[null,null,null,null,null,null,null,null,null,{"$f":"NOT(ISERROR(MATCH(B9,Hoja4!A:A,0)))","v":false}]
[null,null,null,null,null,null,null,null,null,{"$f":"NOT(ISERROR(MATCH(B10,Hoja4!A:A,0)))","v":false}]
[null,null,null,null,null,null,null,null,null,{"$f":"NOT(ISERROR(MATCH(B11,Hoja4!A:A,0)))","v":false}]
[null,null,null,null,null,null,null,null,null,{"$f":"NOT(ISERROR(MATCH(B12,Hoja4!A:A,0)))","v":false}]
[null,null,null,null,null,null,null,null,null,{"$f":"NOT(ISERROR(MATCH(B13,Hoja4!A:A,0)))","v":false}]
[null,null,null,null,null,null,null,null,null,{"$f":"NOT(ISERROR(MATCH(B14,Hoja4!A:A,0)))","v":false}]
[null,null,null,null,null,null,null,null,null,{"$f":"NOT(ISERROR(MATCH(B15,Hoja4!A:A,0)))","v":false}]
[null,null,null,null,null,null,null,null,null,{"$f":"NOT(ISERROR(MATCH(B16,Hoja4!A:A,0)))","v":false}]
[null,null,null,null,null,null,null,null,null,{"$f":"NOT(ISERROR(MATCH(B17,Hoja4!A:A,0)))","v":false}]
[null,null,null,null,null,null,null,null,null,{"$f":"NOT(ISERROR(MATCH(B18,Hoja4!A:A,0)))","v":false}]
[null,null,null,null,null,null,null,null,null,{"$f":"NOT(ISERROR(MATCH(B19,Hoja4!A:A,0)))","v":false}]
[null,null,null,null,null,null,null,null,null,{"$f":"NOT(ISERROR(MATCH(B20,Hoja4!A:A,0)))","v":false}]
[null,null,null,null,null,null,null,null,null,{"$f":"NOT(ISERROR(MATCH(B21,Hoja4!A:A,0)))","v":false}]
[null,null,null,null,null,null,null,null,null,{"$f":"NOT(ISERROR(MATCH(B22,Hoja4!A:A,0)))","v":false}]
[null,null,null,null,null,null,null,null,null,{"$f":"NOT(ISERROR(MATCH(B23,Hoja4!A:A,0)))","v":false}]
[null,null,null,null,null,null,null,null,null,{"$f":"NOT(ISERROR(MATCH(B24,Hoja4!A:A,0)))","v":false}]
[null,null,null,null,null,null,null,null,null,{"$f":"NOT(ISERROR(MATCH(B25,Hoja4!A:A,0)))","v":false}]
[null,null,null,null,null,null,null,null,null,{"$f":"NOT(ISERROR(MATCH(B26,Hoja4!A:A,0)))","v":false}]
[null,null,null,null,null,null,null,null,null,{"$f":"NOT(ISERROR(MATCH(B27,Hoja4!A:A,0)))","v":false}]
[null,null,null,null,null,null,null,null,null,{"$f":"NOT(ISERROR(MATCH(B28,Hoja4!A:A,0)))","v":false}]
[null,null,null,null,null,null,null,null,null,{"$f":"NOT(ISERROR(MATCH(B29,Hoja4!A:A,0)))","v":false}]
[null,null,null,null,null,null,null,null,null,{"$f":"NOT(ISERROR(MATCH(B30,Hoja4!A:A,0)))","v":false}]
[null,null,null,null,null,null,null,null,null,{"$f":"NOT(ISERROR(MATCH(B31,Hoja4!A:A,0)))","v":false}]
[null,null,null,null,null,null,null,null,null,{"$f":"NOT(ISERROR(MATCH(B32,Hoja4!A:A,0)))","v":false}]
[null,null,null,null,null,null,null,null,null,{"$f":"NOT(ISERROR(MATCH(B33,Hoja4!A:A,0)))","v":false}]
[null,null,null,null,null,null,null,null,null,{"$f":"NOT(ISERROR(MATCH(B34,Hoja4!A:A,0)))","v":false}]
[null,null,null,null,null,null,null,null,null,{"$f":"NOT(ISERROR(MATCH(B35,Hoja4!A:A,0)))","v":false}]
[null,null,null,null,null,null,null,null,null,{"$f":"NOT(ISERROR(MATCH(B36,Hoja4!A:A,0)))","v":false}]
[null,null,null,null,null,null,null,null,null,{"$f":"NOT(ISERROR(MATCH(B37,Hoja4!A:A,0)))","v":false}]
[null,null,null,null,null,null,null,null,null,{"$f":"NOT(ISERROR(MATCH(B38,Hoja4!A:A,0)))","v":false}]
[null,null,null,null,null,null,null,null,null,{"$f":"NOT(ISERROR(MATCH(B39,Hoja4!A:A,0)))","v":false}]
[null,null,null,null,null,null,null,null,null,{"$f":"NOT(ISERROR(MATCH(B40,Hoja4!A:A,0)))","v":false}]
[null,null,null,null,null,null,null,null,null,{"$f":"NOT(ISERROR(MATCH(B41,Hoja4!A:A,0)))","v":false}]
[null,null,null,null,null,null,null,null,null,{"$f":"NOT(ISERROR(MATCH(B42,Hoja4!A:A,0)))","v":false}]
[null,null,null,null,null,null,null,null,null,{"$f":"NOT(ISERROR(MATCH(B43,Hoja4!A:A,0)))","v":false}]
[null,null,null,null,null,null,null,null,null,{"$f":"NOT(ISERROR(MATCH(B44,Hoja4!A:A,0)))","v":false}]
[null,null,null,null,null,null,null,null,null,{"$f":"NOT(ISERROR(MATCH(B45,Hoja4!A:A,0)))","v":false}]

{"sheet":"Hoja2","index":1,"n_rows":0,"n_cols":0,"rows_kept":0,"cut":false,"hidden":false,"merged":[]}

{"sheet":"Hoja3","index":2,"n_rows":0,"n_cols":0,"rows_kept":0,"cut":false,"hidden":false,"merged":[]}

{"sheet":"Hoja4","index":3,"n_rows":4865,"n_cols":7,"rows_kept":4865,"cut":false,"hidden":false,"merged":[]}
[420722]
[60906]
[1550762]
[1662694,null,null,null,1152435972,{"$f":"NOT(ISERROR(MATCH(E4,A:A,0)))","v":true}]
[1796756,null,null,null,1036337887,{"$f":"NOT(ISERROR(MATCH(E5,A:A,0)))","v":true}]
[2478681,null,null,null,3438568,{"$f":"NOT(ISERROR(MATCH(E6,A:A,0)))","v":true}]
["NTOCPJ394",null,null,null,1039447865,true]
["X2493528",null,null,null,383097,{"$f":"NOT(ISERROR(MATCH(E8,A:A,0)))","v":true},"en esta hoja se validan las cedulas "]
["X4929520",null,null,null,1214714706,true]
[3616009,null,null,null,1037623711,true]
[5292135,null,null,null,1214714706,true]
["12CR62095"]
[15961369]
[20335254]
[28054194]
[3028018]
[30540456]
[38047365]
[48134382]
[64215902]
[202522273]
[203733848]
[204288643]
[200798061]
[223190786]
[304684939]
[404464054]
[428084026]
[433988522]
[439609005]
[460550791]
[661007423]
[720131237]
[2000083951]
["10AY22945"]
["A22460815"]
["AA641976"]
["AA671673"]
["BA625260"]
["C6JFRRR62"]
["C84PM40W1"]
["EH314004"]
["EI233329"]
["F2906833"]
["N1694491"]
["NPB2B2P148"]
["O46549075"]
["O57278060"]
["PK8154274"]
["PU1115221"]
["C6JFWW308"]
[102543]
[22263]
[144641]
[223649]
[248382]
[248721]
[253868]
[261052]
[271241]
[273874]
[281654]
[285931]
[311271]
[312531]
[314578]
[325557]
[335287]
[343942]
[354290]
[354753]
[355281]
[358146]
[359294]
[360419]
[362102]
[364214]
[369113]
[370225]
[372169]
[376047]
[376515]
[376802]
[376876]
[379810]
[381998]
[383097]
[388671]
[389605]
[397604]
[398175]
[409655]
[417302]
[419433]
[489310]
[4040892]
[627021]
[83094608]
[14981269]
[43250819]
[483782773]
["701035D99RU"]
[98564819]
[205247287]
["BA410084"]
["E354967"]
["E365089"]
["E372981"]
["E376717"]
["E378799"]
["E384026"]
["E384759"]
["E385865"]
["E390381"]
["E391189"]
["E393282"]
["E398545"]
["E399854"]
["E401012"]
[9405200880]
[90061352308]
[91112803098]
[92051501405]
[92071019880]
[92111514528]
[92121375526]
[92122575766]
[93050305633]
[93080214292]
[93080702521]
[93091531656]
[93100128851]
[93101014213]
[93101234779]
[93120806970]
[93122200025]
[93123007270]
[94011708670]
[94020908615]
[94030708169]
[94031708944]
[94051710104]
[94051809453]
[94052528520]
[94053107790]
[94062409414]
[94070508863]
[94071909217]
[9408015609]
[94080707163]
[94080923907]
[94081801716]
[94082209250]
[94082510022]
[94082609479]
[94083009203]
[94090524350]
[94090924758]
[94091508987]
[94092819935]
[94110915017]
[94111307037]
[94111615114]
[94111206796]
[94112113872]
[94112712415]
[94120925401]
[94122321600]
[94122915250]
[94122905459]
[95010623090]
[95011425616]
[95012219602]
[95012520132]
[95020216671]
[95020620731]
[95021421139]
[95031015724]
[95031520771]
[95032110755]
[95042319768]
[95052620156]
[95101019307]
[96010218435]
[96020918842]
[96050714737]
[910826522464]
[1125054]
[2235459]
[2268474]
[2774184]
[2894268]
[3229605]
[3329798]
[3339881]
[3343012]
[3348613]
[3349694]
[3349701]
[3349812]
[3349827]
[3349987]
[3351115]
[3354004]
[3383404]
[3383674]
[3383689]
[3383915]
[3391769]
[3396273]
[3396677]
[3399828]
[3400437]
[3402175]
[3413899]
[3414026]
[3414083]
[3414112]
[3414838]
[3414844]
[3438387]
[3438568]
[3439955]
[3455062]
[3474339]
[3481959]
[3492543]
[3561183]
[3563687]
[3609539]
[3659848]
[3800259]
[4277964]
[4351711]
[4419166]
[4466542]
[4510306]
[5259497]
[5548950]
[6185252]
[6288490]
[6382931]
[6495373]
[6768166]
[6790197]
[6870041]
[6881856]
[7551493]
[7612462]
[7695429]
[7993266]
[8016491]
[8026054]
[8026382]
[8026824]
[8027014]
[8027129]
[8027179]
[8027349]
[8027566]
[8027632]
[8028105]
[8028340]
[8028370]
[8028499]
[8028825]
[8028891]
[8028979]
[8029126]
[8029424]
[8029929]
[8029969]
[8030905]
[8030978]
[8030992]
[8031042]
[8031129]
[8031154]
[8031195]
[8031339]
[8031340]
[8031349]
[8031433]
[8031481]
[8031506]
[8031519]
[8031534]
[8031743]
[8031756]
[8032023]
[8032091]
[8032371]
[8032409]
[8032475]
[8032794]
[8032935]
[8033251]
[8033305]
[8033565]
[8033581]
[8033683]
[8033758]
[8033784]
[8060597]
[8061078]
[8061094]
[8061148]
[8061491]
[8062995]
[8064124]
[8064526]
[8071414]
[8071587]
[8071750]
[8101093]
[8102235]
[8102363]
[8103252]
[8103528]
[8103665]
[8104214]
[8104337]
[8104351]
[8104535]
[8106541]
[8106677]
[8125135]
[8125253]
[8126039]
[8126253]
[8126384]
[8126470]
[8127144]
[8127396]
[8127407]
[8127430]
[8128282]
[8128653]
[8128753]
[8129259]
[8129873]
[8160037]
[8160066]
[8160157]
[8160306]
[8160427]
[8160737]
[8160753]
[8160783]
[8161036]
[8161138]
[8161385]
[8161579]
[8161668]
[8161685]
[8161690]
[8161709]
[8161709]
[8161720]
[8162051]
[8162502]
[8162583]
[8162647]
[8162816]
[8162914]
[8162960]
[8163350]
[8163445]
[8163502]
[8163518]
[8163695]
[8163746]
[8163847]
[8163959]
[8164293]
[8164750]
[8164814]
[8164836]
[8175596]
[8208035]
[8211681]
[8212835]
[8230851]
[8232979]
[8244385]
[8245697]
[8250251]
[8255268]
[8263567]
[8266030]
[8273435]
[8278679]
[8280784]
[8281852]
[8282057]
[8291154]
[8293070]
[8301595]
[8301829]
[8302038]
{"$rows_left_out":4466}
{"sheet":"Datos","index":4,"n_rows":0,"n_cols":0,"rows_kept":0,"cut":false,"hidden":false,"merged":[]}

{"sheet":"PreEmpleo","index":5,"n_rows":0,"n_cols":0,"rows_kept":0,"cut":false,"hidden":false,"merged":[]}